Reaction Details
TargetIntegrase
LigandBDBM50045083
Substrate/Competitorn/a
Meas. Tech.ChEMBL_1457167 (CHEMBL3369753)
IC50 3.0±n/a nM
Citation Johns, BAKawasuji, TWeatherhead, JGBoros, EEThompson, JBKoble, CSGarvey, EPFoster, SAJeffrey, JLFujiwara, T Naphthyridinone (NTD) integrase inhibitors 4. Investigating N1 acetamide substituent effects with C3 amide groups. Bioorg Med Chem Lett24:3104-7 (2014) 
 
Integrase
Name:Integrase
Synonyms:pol
Type:PROTEIN
Mol. Mass.:32203.43
Organism:Human immunodeficiency virus 1
Description:ChEMBL_106649
Residue:288
BDBM50045083
NameBDBM50045083
Synonyms:CHEMBL3310085
TypeSmall organic molecule
Emp. Form.C23H23FN4O4
Mol. Mass.438.4515
SMILESCN(C)C(=O)Cn1c2cc(Cc3ccc(F)cc3)cnc2c(O)c(C(=O)NC2CC2)c1=O