Reaction Details
TargetIntegrase
LigandBDBM50045107
Substrate/Competitorn/a
Meas. Tech.ChEMBL_1457167 (CHEMBL3369753)
IC50 8.1±n/a nM
Citation Johns, BAKawasuji, TWeatherhead, JGBoros, EEThompson, JBKoble, CSGarvey, EPFoster, SAJeffrey, JLFujiwara, T Naphthyridinone (NTD) integrase inhibitors 4. Investigating N1 acetamide substituent effects with C3 amide groups. Bioorg Med Chem Lett24:3104-7 (2014) 
 
Integrase
Name:Integrase
Synonyms:pol
Type:PROTEIN
Mol. Mass.:32203.43
Organism:Human immunodeficiency virus 1
Description:ChEMBL_106649
Residue:288
BDBM50045107
NameBDBM50045107
TypeSmall organic molecule
Emp. Form.C19H18FN3O4
Mol. Mass.371.3623
SMILESCn1c2cc(Cc3ccc(F)cc3)cnc2c(O)c(C(=O)NCCO)c1=O