Reaction Details
TargetC-C chemokine receptor type 4
LigandBDBM50380881
Substrate/Competitorn/a
Meas. Tech.ChEMBL_1458079 (CHEMBL3367642)
IC50 5.5±n/a nM
Citation Miah, AHAbas, HBegg, MMarsh, BJO'Flynn, DEFord, AJPercy, JMProcopiou, PARichards, SARumley, SA Lead identification of benzimidazolone and azabenzimidazolone arylsulfonamides as CC-chemokine receptor 4 (CCR4) antagonists. Bioorg Med Chem22:4298-311 (2014) 
 
C-C chemokine receptor type 4
Name:C-C chemokine receptor type 4
Type:Enzyme
Mol. Mass.:41406.41
Organism:Homo sapiens (Human)
Description:P51679
Residue:360
BDBM50380881
NameBDBM50380881
Synonyms:CHEMBL2018953
TypeSmall organic molecule
Emp. Form.C24H27Cl2N7O
Mol. Mass.500.423
SMILESClc1ccc(CNc2nc(nc3ncccc23)N2CCN(CC2)C(=O)[C@H]2CCCCN2)c(Cl)c1