Reaction Details
TargetGlycogen synthase kinase-3 beta
LigandBDBM50045370
Substrate/Competitorn/a
Meas. Tech.ChEMBL_1459853 (CHEMBL3367276)
IC50>30000±n/a nM
Citation Xiao, DZhu, XSofolarides, MDegrado, SShao, NRao, AChen, XAslanian, RFossetta, JTian, FTrivedi, PLundell, DPalani, A Discovery of a novel series of potent MK2 non-ATP competitive inhibitors using 1,2-substituted azoles as cis-amide isosteres. Bioorg Med Chem Lett24:3609-13 (2014) 
 
Glycogen synthase kinase-3 beta
Name:Glycogen synthase kinase-3 beta
Type:Enzyme
Mol. Mass.:46756.38
Organism:Homo sapiens (Human)
Description:P49841
Residue:420
BDBM50045370
NameBDBM50045370
Synonyms:CHEMBL3314140
TypeSmall organic molecule
Emp. Form.C23H21ClN4O
Mol. Mass.404.892
SMILESClc1ccc(cc1)-c1ccc(o1)-c1nccn1-c1ccc(cc1)N1CCNCC1