Reaction Details
TargetMitogen-activated protein kinase 1
LigandBDBM50045370
Substrate/Competitorn/a
Meas. Tech.ChEMBL_1459849 (CHEMBL3371235)
IC50>30000±n/a nM
Citation Xiao, DZhu, XSofolarides, MDegrado, SShao, NRao, AChen, XAslanian, RFossetta, JTian, FTrivedi, PLundell, DPalani, A Discovery of a novel series of potent MK2 non-ATP competitive inhibitors using 1,2-substituted azoles as cis-amide isosteres. Bioorg Med Chem Lett24:3609-13 (2014) 
 
Mitogen-activated protein kinase 1
Name:Mitogen-activated protein kinase 1
Type:Ser/Thr Protein Kinase
Mol. Mass.:41392.76
Organism:Homo sapiens (Human)
Description:P28482
Residue:360
BDBM50045370
NameBDBM50045370
Synonyms:CHEMBL3314140
TypeSmall organic molecule
Emp. Form.C23H21ClN4O
Mol. Mass.404.892
SMILESClc1ccc(cc1)-c1ccc(o1)-c1nccn1-c1ccc(cc1)N1CCNCC1