Reaction Details
TargetMAP kinase-activated protein kinase 2
LigandBDBM50045371
Substrate/Competitorn/a
Meas. Tech.ChEMBL_1458999 (CHEMBL3369592)
IC50 26±n/a nM
Citation Xiao, DZhu, XSofolarides, MDegrado, SShao, NRao, AChen, XAslanian, RFossetta, JTian, FTrivedi, PLundell, DPalani, A Discovery of a novel series of potent MK2 non-ATP competitive inhibitors using 1,2-substituted azoles as cis-amide isosteres. Bioorg Med Chem Lett24:3609-13 (2014) 
 
MAP kinase-activated protein kinase 2
Name:MAP kinase-activated protein kinase 2
Type:Serine/threonine-protein kinase
Mol. Mass.:45579.87
Organism:Homo sapiens (Human)
Description:P49137
Residue:400
BDBM50045371
NameBDBM50045371
Synonyms:CHEMBL3315292
TypeSmall organic molecule
Emp. Form.C25H22N4O2
Mol. Mass.410.4678
SMILESOC1(CCNCC1)c1ccc(cc1)-n1ccnc1-c1ccc(o1)-c1ccc(cc1)C#N