Reaction Details
TargetSigma non-opioid intracellular receptor 1
LigandBDBM50120477
Substrate/Competitorn/a
Meas. Tech.ChEMBL_1459860 (CHEMBL3367283)
Ki 16±n/a nM
Citation Miyata, KMöller, GSchepmann, DWünsch, B Pyridine analogues of spirocyclics1 receptor ligands. Bioorg Med Chem22:4277-84 (2014) 
 
Sigma non-opioid intracellular receptor 1
Name:Sigma non-opioid intracellular receptor 1
Type:Protein
Mol. Mass.:25307.17
Organism:Cavia porcellus (Guinea pig)
Description:Q60492
Residue:223
BDBM50120477
NameBDBM50120477
Synonyms:1'-benzylspiro[3,4-dihydro-1H-isochromene-1,4'-(hexahydropyridine)]-3-ylmethyl cyanide | CHEMBL148289
TypeSmall organic molecule
Emp. Form.C22H24N2O
Mol. Mass.332.4388
SMILESN#CCC1Cc2ccccc2C2(CCN(Cc3ccccc3)CC2)O1