Reaction Details
TargetSigma non-opioid intracellular receptor 1
LigandBDBM50045432
Substrate/Competitorn/a
Meas. Tech.ChEMBL_1459860 (CHEMBL3367283)
Ki 44±n/a nM
Citation Miyata, KMöller, GSchepmann, DWünsch, B Pyridine analogues of spirocyclics1 receptor ligands. Bioorg Med Chem22:4277-84 (2014) 
 
Sigma non-opioid intracellular receptor 1
Name:Sigma non-opioid intracellular receptor 1
Type:Protein
Mol. Mass.:25307.17
Organism:Cavia porcellus (Guinea pig)
Description:Q60492
Residue:223
BDBM50045432
NameBDBM50045432
Synonyms:CHEMBL3309611
TypeSmall organic molecule
Emp. Form.C22H28N2O2
Mol. Mass.352.4699
SMILESCOC1Cc2ccncc2C2(CCN(CCCc3ccccc3)CC2)O1