Reaction Details
TargetSigma non-opioid intracellular receptor 1
LigandBDBM50045435
Substrate/Competitorn/a
Meas. Tech.ChEMBL_1459860 (CHEMBL3367283)
Ki 4.6±n/a nM
Citation Miyata, KMöller, GSchepmann, DWünsch, B Pyridine analogues of spirocyclics1 receptor ligands. Bioorg Med Chem22:4277-84 (2014) 
 
Sigma non-opioid intracellular receptor 1
Name:Sigma non-opioid intracellular receptor 1
Type:Protein
Mol. Mass.:25307.17
Organism:Cavia porcellus (Guinea pig)
Description:Q60492
Residue:223
BDBM50045435
NameBDBM50045435
Synonyms:CHEMBL3309614
TypeSmall organic molecule
Emp. Form.C19H20N2O
Mol. Mass.292.3749
SMILESC(N1CCC2(CC1)OC=Cc1ccncc21)c1ccccc1