Reaction Details
TargetKiSS-1 receptor
LigandBDBM50045509
Substrate/Competitorn/a
Meas. Tech.ChEMBL_1448383 (CHEMBL3376867)
EC50 4.2±n/a nM
Citation Asami, TNishizawa, NMatsui, HTakatsu, YSuzuki, AKiba, ATerada, MNishibori, KNakayama, MBan, JMatsumoto, STarui, NIkeda, YYamaguchi, MKusaka, MOhtaki, TKitada, C Physicochemically and pharmacokinetically stable nonapeptide KISS1 receptor agonists with highly potent testosterone-suppressive activity. J Med Chem57:6105-15 (2014) 
 
KiSS-1 receptor
Name:KiSS-1 receptor
Type:PROTEIN
Mol. Mass.:42915.37
Organism:Rattus norvegicus
Description:ChEMBL_1448383
Residue:396
BDBM50045509
NameBDBM50045509
Synonyms:CHEMBL3314226
TypeSmall organic molecule
Emp. Form.C66H85N17O13
Mol. Mass.1324.4872
SMILESCNC(=N)NCCC[C@H](NC(=O)[C@H](CC(C)C)NC(=O)NNC(=O)[C@H](Cc1ccccc1)NC(=O)[C@@H](NC(=O)[C@H](CC(N)=O)NC(=O)[C@@H](Cc1c[nH]c2ccccc12)NC(=O)[C@@H](Cc1ccc(O)cc1)NC(=O)C1CC1)[C@@H](C)O)C(=O)N[C@@H](Cc1c[nH]c2ccccc12)C(N)=O