Reaction Details
TargetKiSS-1 receptor
LigandBDBM50045505
Substrate/Competitorn/a
Meas. Tech.ChEMBL_1448386 (CHEMBL3376870)
Ki 0.830000±n/a nM
Citation Asami, TNishizawa, NMatsui, HTakatsu, YSuzuki, AKiba, ATerada, MNishibori, KNakayama, MBan, JMatsumoto, STarui, NIkeda, YYamaguchi, MKusaka, MOhtaki, TKitada, C Physicochemically and pharmacokinetically stable nonapeptide KISS1 receptor agonists with highly potent testosterone-suppressive activity. J Med Chem57:6105-15 (2014) 
 
KiSS-1 receptor
Name:KiSS-1 receptor
Type:PROTEIN
Mol. Mass.:42915.37
Organism:Rattus norvegicus
Description:ChEMBL_1448383
Residue:396
BDBM50045505
NameBDBM50045505
Synonyms:CHEMBL3314222
TypeSmall organic molecule
Emp. Form.C61H80N16O11
Mol. Mass.1213.3885
SMILESCC[C@H](NC(=O)[C@@H](Cc1c[nH]c2ccccc12)NC(=O)[C@H](N)Cc1ccc(O)cc1)C(=O)N[C@@H](CO)C(=O)N[C@@H](Cc1ccccc1)C(=O)NNC(=O)N[C@@H](CC(C)C)C(=O)N[C@@H](CCCNC(=N)NC)C(=O)N[C@@H](Cc1c[nH]c2ccccc12)C(N)=O