Reaction Details
TargetPolyunsaturated fatty acid lipoxygenase ALOX15B
LigandBDBM50045523
Substrate/Competitorn/a
Meas. Tech.ChEMBL_1449307 (CHEMBL3371453)
IC50>100000±n/a nM
Citation Armstrong, MMDiaz, GKenyon, VHolman, TR Inhibitory and mechanistic investigations of oxo-lipids with human lipoxygenase isozymes. Bioorg Med Chem22:4293-7 (2014) 
 
Polyunsaturated fatty acid lipoxygenase ALOX15B
Name:Polyunsaturated fatty acid lipoxygenase ALOX15B
Type:Protein
Mol. Mass.:75850.40
Organism:Homo sapiens (Human)
Description:n/a
Residue:676
BDBM50045523
NameBDBM50045523
Synonyms:CHEBI:34151 | CHEMBL3310737
TypeSmall organic molecule
Emp. Form.C20H30O3
Mol. Mass.318.4504
SMILESCCCCC\C=C/CC(=O)\C=C\C=C/C\C=C/CCCC(O)=O