Reaction Details
TargetP2Y purinoceptor 2
LigandBDBM50045597
Substrate/Competitorn/a
Meas. Tech.ChEMBL_1455361 (CHEMBL3362990)
IC50>10000±n/a nM
Citation Yang, WWang, YLai, AQiao, JXWang, TCHua, JPrice, LAShen, HChen, XQWong, PCrain, EWatson, CHuang, CSSeiffert, DARehfuss, RWexler, RRLam, PY Discovery of 4-aryl-7-hydroxyindoline-based P2Y1 antagonists as novel antiplatelet agents. J Med Chem57:6150-64 (2014) 
 
P2Y purinoceptor 2
Name:P2Y purinoceptor 2
Type:PROTEIN
Mol. Mass.:42299.21
Organism:Homo sapiens (Human)
Description:ChEMBL_1455361
Residue:377
BDBM50045597
NameBDBM50045597
Synonyms:CHEMBL3314321 | US9428504, 152
TypeSmall organic molecule
Emp. Form.C36H35ClF2N6O2S
Mol. Mass.689.217
SMILESCC(C)(C)CN1CCC2(CN(c3c2c(c(F)cc3O)-c2ccc(F)cc2)c2ccccc2NC(=O)Nc2nc3ccc(Cl)nc3s2)CC1