Reaction Details
TargetP2Y purinoceptor 1
LigandBDBM50015276
Substrate/Competitorn/a
Meas. Tech.ChEMBL_1454530 (CHEMBL3365972)
IC50 0.120000±n/a nM
Citation Yang, WWang, YLai, AQiao, JXWang, TCHua, JPrice, LAShen, HChen, XQWong, PCrain, EWatson, CHuang, CSSeiffert, DARehfuss, RWexler, RRLam, PY Discovery of 4-aryl-7-hydroxyindoline-based P2Y1 antagonists as novel antiplatelet agents. J Med Chem57:6150-64 (2014) 
 
P2Y purinoceptor 1
Name:P2Y purinoceptor 1
Type:Enzyme
Mol. Mass.:42090.25
Organism:Homo sapiens (Human)
Description:P47900
Residue:373
BDBM50015276
NameBDBM50015276
Synonyms:CHEMBL3263056 US9428504, 167
TypeSmall organic molecule
Emp. Form.C30H32Cl2N6O2S
Mol. Mass.611.585
SMILESCC(C)(C)CN1CCC2(CN(c3c2c(Cl)ccc3O)c2ccccc2NC(=O)Nc2nc3ccc(Cl)nc3s2)CC1