Reaction Details
TargetP2Y purinoceptor 1
LigandBDBM50045606
Substrate/Competitorn/a
Meas. Tech.ChEMBL_1454530 (CHEMBL3365972)
IC50 0.090000±n/a nM
Citation Yang, WWang, YLai, AQiao, JXWang, TCHua, JPrice, LAShen, HChen, XQWong, PCrain, EWatson, CHuang, CSSeiffert, DARehfuss, RWexler, RRLam, PY Discovery of 4-aryl-7-hydroxyindoline-based P2Y1 antagonists as novel antiplatelet agents. J Med Chem57:6150-64 (2014) 
 
P2Y purinoceptor 1
Name:P2Y purinoceptor 1
Type:Enzyme
Mol. Mass.:42090.25
Organism:Homo sapiens (Human)
Description:P47900
Residue:373
BDBM50045606
NameBDBM50045606
Synonyms:CHEMBL3314320 | US9428504, 155
TypeSmall organic molecule
Emp. Form.C37H37F5N4O3
Mol. Mass.680.7067
SMILESCC(C)(C)CN1CCC2(CN(c3c2c(c(F)cc3O)-c2ccc(F)cc2)c2ccccc2NC(=O)Nc2ccc(OC(F)(F)F)cc2)CC1