Reaction Details
TargetP2Y purinoceptor 1
LigandBDBM50045610
Substrate/Competitorn/a
Meas. Tech.ChEMBL_1454531 (CHEMBL3365973)
IC50 3100±n/a nM
Citation Yang, WWang, YLai, AQiao, JXWang, TCHua, JPrice, LAShen, HChen, XQWong, PCrain, EWatson, CHuang, CSSeiffert, DARehfuss, RWexler, RRLam, PY Discovery of 4-aryl-7-hydroxyindoline-based P2Y1 antagonists as novel antiplatelet agents. J Med Chem57:6150-64 (2014) 
 
P2Y purinoceptor 1
Name:P2Y purinoceptor 1
Type:Enzyme
Mol. Mass.:42090.25
Organism:Homo sapiens (Human)
Description:P47900
Residue:373
BDBM50045610
NameBDBM50045610
Synonyms:CHEMBL3314290 US9540323, example 74
TypeSmall organic molecule
Emp. Form.C26H23ClF3N3O5
Mol. Mass.549.926
SMILESCCOC(=O)C1(C)CN(c2c1c(Cl)ccc2O)c1ccccc1NC(=O)Nc1ccc(OC(F)(F)F)cc1