Reaction Details
TargetP2Y purinoceptor 1
LigandBDBM50045607
Substrate/Competitorn/a
Meas. Tech.ChEMBL_1454530 (CHEMBL3365972)
IC50 0.140000±n/a nM
Citation Yang, WWang, YLai, AQiao, JXWang, TCHua, JPrice, LAShen, HChen, XQWong, PCrain, EWatson, CHuang, CSSeiffert, DARehfuss, RWexler, RRLam, PY Discovery of 4-aryl-7-hydroxyindoline-based P2Y1 antagonists as novel antiplatelet agents. J Med Chem57:6150-64 (2014) 
 
P2Y purinoceptor 1
Name:P2Y purinoceptor 1
Type:Enzyme
Mol. Mass.:42090.25
Organism:Homo sapiens (Human)
Description:P47900
Residue:373
BDBM50045607
NameBDBM50045607
Synonyms:CHEMBL3314287
TypeSmall organic molecule
Emp. Form.C23H19Cl2N5O2S
Mol. Mass.500.4
SMILESCC1(C)CN(c2c1c(Cl)ccc2O)c1ccccc1NC(=O)Nc1nc2ccc(Cl)nc2s1