Reaction Details
TargetP2Y purinoceptor 1
LigandBDBM50045612
Substrate/Competitorn/a
Meas. Tech.ChEMBL_1454530 (CHEMBL3365972)
IC50 0.370000±n/a nM
Citation Yang, WWang, YLai, AQiao, JXWang, TCHua, JPrice, LAShen, HChen, XQWong, PCrain, EWatson, CHuang, CSSeiffert, DARehfuss, RWexler, RRLam, PY Discovery of 4-aryl-7-hydroxyindoline-based P2Y1 antagonists as novel antiplatelet agents. J Med Chem57:6150-64 (2014) 
 
P2Y purinoceptor 1
Name:P2Y purinoceptor 1
Type:Enzyme
Mol. Mass.:42090.25
Organism:Homo sapiens (Human)
Description:P47900
Residue:373
BDBM50045612
NameBDBM50045612
Synonyms:CHEMBL3314295 US9540323, example 195
TypeSmall organic molecule
Emp. Form.C30H26F3N3O3
Mol. Mass.533.5409
SMILESCC1(C)CN(c2c1c(ccc2O)-c1ccccc1)c1ccccc1NC(=O)Nc1ccc(OC(F)(F)F)cc1