Reaction Details
TargetPotassium voltage-gated channel subfamily E member 1
LigandBDBM50045833
Substrate/Competitorn/a
Meas. Tech.ChEMBL_1456351 (CHEMBL3368360)
IC50 10500±n/a nM
Citation Georgsson, JBergström, FNordqvist, AWatson, MJBlundell, CDJohansson, MJPetersson, AUYuan, ZQZhou, YKristensson, LKakol-Palm, DTyrchan, CWellner, EBauer, UBrodin, PSvensson Henriksson, A GPR103 antagonists demonstrating anorexigenic activity in vivo: design and development of pyrrolo[2,3-c]pyridines that mimic the C-terminal Arg-Phe motif of QRFP26. J Med Chem57:5935-48 (2014) 
 
Potassium voltage-gated channel subfamily E member 1
Name:Potassium voltage-gated channel subfamily E member 1
Type:PROTEIN
Mol. Mass.:14676.11
Organism:Homo sapiens (Human)
Description:ChEMBL_1456351
Residue:129
BDBM50045833
NameBDBM50045833
Synonyms:CHEMBL3314349
TypeSmall organic molecule
Emp. Form.C22H24ClN3O
Mol. Mass.381.898
SMILESCN(C)Cc1ccc2CN(CCc2c1)C(=O)c1cc2cc(Cl)ccc2n1C