Reaction Details
TargetPyroglutamylated RF-amide peptide receptor
LigandBDBM50045838
Substrate/Competitorn/a
Meas. Tech.ChEMBL_1456340 (CHEMBL3368108)
IC50 110±n/a nM
Citation Georgsson, JBergström, FNordqvist, AWatson, MJBlundell, CDJohansson, MJPetersson, AUYuan, ZQZhou, YKristensson, LKakol-Palm, DTyrchan, CWellner, EBauer, UBrodin, PSvensson Henriksson, A GPR103 antagonists demonstrating anorexigenic activity in vivo: design and development of pyrrolo[2,3-c]pyridines that mimic the C-terminal Arg-Phe motif of QRFP26. J Med Chem57:5935-48 (2014) 
 
Pyroglutamylated RF-amide peptide receptor
Name:Pyroglutamylated RF-amide peptide receptor
Type:Enzyme Catalytic Domain
Mol. Mass.:49508.46
Organism:Homo sapiens (Human)
Description:GPR103 0 HUMAN::Q96P65
Residue:431
BDBM50045838
NameBDBM50045838
Synonyms:CHEMBL3314358
TypeSmall organic molecule
Emp. Form.C22H25BrN4O
Mol. Mass.441.364
SMILESCC1CN(Cc2ccc(CN(C)C)cc12)C(=O)c1cc2cc(Br)ncc2n1C