Reaction Details
TargetCytochrome P450 2D6
LigandBDBM50046058
Substrate/Competitorn/a
Meas. Tech.ChEMBL_1458159 (CHEMBL3368205)
IC50>20000±n/a nM
Citation Clemens, JJCoon, TBusch, BBAsgian, JLHudson, STermin, AFlores, TBTran, DChiang, PSperry, SGross, RAbt, JHeim, RLechner, STwin, HStudley, JBrenchley, GCollier, PNPierard, FMiller, AMak, CDvornikovs, VJimenez, JMStamos, D Strategies for the modulation of phase II metabolism in a series of PKCe inhibitors. Bioorg Med Chem Lett24:3398-402 (2014) 
 
Cytochrome P450 2D6
Name:Cytochrome P450 2D6
Type:Protein
Mol. Mass.:55774.82
Organism:Homo sapiens (Human)
Description:P10635
Residue:497
BDBM50046058
NameBDBM50046058
Synonyms:CHEMBL3310294
TypeSmall organic molecule
Emp. Form.C20H17F3N4O2
Mol. Mass.402.3698
SMILESOC[C@@H](O)Cc1cc(cc(c1)C1(CC1)C#N)-c1ccnc2[nH]nc(c12)C(F)(F)F