Reaction Details
TargetProtein kinase C epsilon type
LigandBDBM50046103
Substrate/Competitorn/a
Meas. Tech.ChEMBL_1458147 (CHEMBL3368193)
Ki 77±n/a nM
Citation Clemens, JJCoon, TBusch, BBAsgian, JLHudson, STermin, AFlores, TBTran, DChiang, PSperry, SGross, RAbt, JHeim, RLechner, STwin, HStudley, JBrenchley, GCollier, PNPierard, FMiller, AMak, CDvornikovs, VJimenez, JMStamos, D Strategies for the modulation of phase II metabolism in a series of PKCe inhibitors. Bioorg Med Chem Lett24:3398-402 (2014) 
 
Protein kinase C epsilon type
Name:Protein kinase C epsilon type
Type:Enzyme
Mol. Mass.:83680.45
Organism:Homo sapiens (Human)
Description:The recombinant human PKC enzymes were produced using a baculovirus expression system in SF9 cells
Residue:737
BDBM50046103
NameBDBM50046103
Synonyms:CHEMBL3310296
TypeSmall organic molecule
Emp. Form.C21H19F3N4O2
Mol. Mass.416.3964
SMILESCOCC(O)Cc1cc(cc(c1)C1(CC1)C#N)-c1ccnc2[nH]nc(c12)C(F)(F)F