Reaction Details
TargetIndoleamine 2,3-dioxygenase 1
LigandBDBM50046104
Substrate/Competitorn/a
Meas. Tech.ChEMBL_1458165 (CHEMBL3368211)
EC50>10.0±n/a nM
Citation Cheng, MFHung, MSSong, JSLin, SYLiao, FYWu, MHHsiao, WHsieh, CLWu, JSChao, YSShih, CWu, SYUeng, SH Discovery and structure-activity relationships of phenyl benzenesulfonylhydrazides as novel indoleamine 2,3-dioxygenase inhibitors. Bioorg Med Chem Lett24:3403-6 (2014) 
 
Indoleamine 2,3-dioxygenase 1
Name:Indoleamine 2,3-dioxygenase 1
Type:Enzyme
Mol. Mass.:45330.80
Organism:Homo sapiens (Human)
Description:P14902
Residue:403
BDBM50046104
NameBDBM50046104
Synonyms:CHEMBL3310297
TypeSmall organic molecule
Emp. Form.C14H16N2O2S
Mol. Mass.276.354
SMILESO=S(=O)(CCc1ccccc1)NNc1ccccc1