Reaction Details
TargetIndoleamine 2,3-dioxygenase 1
LigandBDBM50046150
Substrate/Competitorn/a
Meas. Tech.ChEMBL_1458165 (CHEMBL3368211)
EC50 134±n/a nM
Citation Cheng, MFHung, MSSong, JSLin, SYLiao, FYWu, MHHsiao, WHsieh, CLWu, JSChao, YSShih, CWu, SYUeng, SH Discovery and structure-activity relationships of phenyl benzenesulfonylhydrazides as novel indoleamine 2,3-dioxygenase inhibitors. Bioorg Med Chem Lett24:3403-6 (2014) 
 
Indoleamine 2,3-dioxygenase 1
Name:Indoleamine 2,3-dioxygenase 1
Type:Enzyme
Mol. Mass.:45330.80
Organism:Homo sapiens (Human)
Description:P14902
Residue:403
BDBM50046150
NameBDBM50046150
Synonyms:CHEMBL3310976
TypeSmall organic molecule
Emp. Form.C13H10BrN3O2S
Mol. Mass.352.206
SMILESBrc1ccc(NNS(=O)(=O)c2ccc(cc2)C#N)cc1