Reaction Details
TargetIndoleamine 2,3-dioxygenase 1
LigandBDBM50046148
Substrate/Competitorn/a
Meas. Tech.ChEMBL_1458164 (CHEMBL3368210)
IC50 172±n/a nM
Citation Cheng, MFHung, MSSong, JSLin, SYLiao, FYWu, MHHsiao, WHsieh, CLWu, JSChao, YSShih, CWu, SYUeng, SH Discovery and structure-activity relationships of phenyl benzenesulfonylhydrazides as novel indoleamine 2,3-dioxygenase inhibitors. Bioorg Med Chem Lett24:3403-6 (2014) 
 
Indoleamine 2,3-dioxygenase 1
Name:Indoleamine 2,3-dioxygenase 1
Type:Enzyme
Mol. Mass.:45330.80
Organism:Homo sapiens (Human)
Description:P14902
Residue:403
BDBM50046148
NameBDBM50046148
Synonyms:CHEMBL3310973
TypeSmall organic molecule
Emp. Form.C12H11BrN2O2S
Mol. Mass.327.197
SMILESBrc1ccc(NNS(=O)(=O)c2ccccc2)cc1