Reaction Details
TargetIndoleamine 2,3-dioxygenase 1
LigandBDBM50046151
Substrate/Competitorn/a
Meas. Tech.ChEMBL_1458165 (CHEMBL3368211)
EC50 183±n/a nM
Citation Cheng, MFHung, MSSong, JSLin, SYLiao, FYWu, MHHsiao, WHsieh, CLWu, JSChao, YSShih, CWu, SYUeng, SH Discovery and structure-activity relationships of phenyl benzenesulfonylhydrazides as novel indoleamine 2,3-dioxygenase inhibitors. Bioorg Med Chem Lett24:3403-6 (2014) 
 
Indoleamine 2,3-dioxygenase 1
Name:Indoleamine 2,3-dioxygenase 1
Type:Enzyme
Mol. Mass.:45330.80
Organism:Homo sapiens (Human)
Description:P14902
Residue:403
BDBM50046151
NameBDBM50046151
Synonyms:CHEMBL3310979
TypeSmall organic molecule
Emp. Form.C15H15BrN2O4S
Mol. Mass.399.26
SMILESOC(=O)CCc1ccc(cc1)S(=O)(=O)NNc1ccc(Br)cc1