Reaction Details
TargetIndoleamine 2,3-dioxygenase 1
LigandBDBM50046136
Substrate/Competitorn/a
Meas. Tech.ChEMBL_1458165 (CHEMBL3368211)
EC50 271±n/a nM
Citation Cheng, MFHung, MSSong, JSLin, SYLiao, FYWu, MHHsiao, WHsieh, CLWu, JSChao, YSShih, CWu, SYUeng, SH Discovery and structure-activity relationships of phenyl benzenesulfonylhydrazides as novel indoleamine 2,3-dioxygenase inhibitors. Bioorg Med Chem Lett24:3403-6 (2014) 
 
Indoleamine 2,3-dioxygenase 1
Name:Indoleamine 2,3-dioxygenase 1
Type:Enzyme
Mol. Mass.:45330.80
Organism:Homo sapiens (Human)
Description:P14902
Residue:403
BDBM50046136
NameBDBM50046136
Synonyms:CHEMBL3310298
TypeSmall organic molecule
Emp. Form.C16H17N3O5S
Mol. Mass.363.388
SMILESCc1cccc(NNS(=O)(=O)c2ccc(cc2)C(=O)NCC(O)=O)c1