Reaction Details
TargetIndoleamine 2,3-dioxygenase 1
LigandBDBM50046160
Substrate/Competitorn/a
Meas. Tech.ChEMBL_1458164 (CHEMBL3368210)
IC50 1431±n/a nM
Citation Cheng, MFHung, MSSong, JSLin, SYLiao, FYWu, MHHsiao, WHsieh, CLWu, JSChao, YSShih, CWu, SYUeng, SH Discovery and structure-activity relationships of phenyl benzenesulfonylhydrazides as novel indoleamine 2,3-dioxygenase inhibitors. Bioorg Med Chem Lett24:3403-6 (2014) 
 
Indoleamine 2,3-dioxygenase 1
Name:Indoleamine 2,3-dioxygenase 1
Type:Enzyme
Mol. Mass.:45330.80
Organism:Homo sapiens (Human)
Description:P14902
Residue:403
BDBM50046160
NameBDBM50046160
Synonyms:CHEMBL3310975
TypeSmall organic molecule
Emp. Form.C13H13BrN2O3S
Mol. Mass.357.223
SMILESCOc1ccc(cc1)S(=O)(=O)NNc1ccc(Br)cc1