Reaction Details
TargetIndoleamine 2,3-dioxygenase 1
LigandBDBM50046162
Substrate/Competitorn/a
Meas. Tech.ChEMBL_1458164 (CHEMBL3368210)
IC50 1746±n/a nM
Citation Cheng, MFHung, MSSong, JSLin, SYLiao, FYWu, MHHsiao, WHsieh, CLWu, JSChao, YSShih, CWu, SYUeng, SH Discovery and structure-activity relationships of phenyl benzenesulfonylhydrazides as novel indoleamine 2,3-dioxygenase inhibitors. Bioorg Med Chem Lett24:3403-6 (2014) 
 
Indoleamine 2,3-dioxygenase 1
Name:Indoleamine 2,3-dioxygenase 1
Type:Enzyme
Mol. Mass.:45330.80
Organism:Homo sapiens (Human)
Description:P14902
Residue:403
BDBM50046162
NameBDBM50046162
Synonyms:CHEMBL3310862
TypeSmall organic molecule
Emp. Form.C14H13F2N3O3S
Mol. Mass.341.333
SMILESCC(=O)Nc1ccc(cc1)S(=O)(=O)NNc1cc(F)cc(F)c1