Reaction Details
TargetCarbonic anhydrase 2
LigandBDBM50046166
Substrate/Competitorn/a
Meas. Tech.ChEMBL_1447567 (CHEMBL3373762)
IC50 8071±n/a nM
Citation Rosatelli, ECarotti, ACeruso, MSupuran, CTGioiello, A Flow synthesis and biological activity of aryl sulfonamides as selective carbonic anhydrase IX and XII inhibitors. Bioorg Med Chem Lett24:3422-5 (2014) 
 
Carbonic anhydrase 2
Name:Carbonic anhydrase 2
Type:Enzyme
Mol. Mass.:29250.71
Organism:Homo sapiens (Human)
Description:P00918
Residue:260
BDBM50046166
NameBDBM50046166
Synonyms:CHEMBL3310984
TypeSmall organic molecule
Emp. Form.C12H19NO2S
Mol. Mass.241.35
SMILESCCCC(C)NS(=O)(=O)c1ccc(C)cc1