Reaction Details
TargetCarbonic anhydrase 12
LigandBDBM50016567
Substrate/Competitorn/a
Meas. Tech.ChEMBL_1447570 (CHEMBL3373765)
IC50 8570±n/a nM
Citation Rosatelli, ECarotti, ACeruso, MSupuran, CTGioiello, A Flow synthesis and biological activity of aryl sulfonamides as selective carbonic anhydrase IX and XII inhibitors. Bioorg Med Chem Lett24:3422-5 (2014) 
 
Carbonic anhydrase 12
Name:Carbonic anhydrase 12
Type:Enzyme
Mol. Mass.:39456.00
Organism:Homo sapiens (Human)
Description:Catalytic domain of human cloned isozyme was used in the assay
Residue:354
BDBM50016567
NameBDBM50016567
Synonyms:(Toluene-4-sulfonylamino)-acetic acid | CHEMBL287486
TypeSmall organic molecule
Emp. Form.C9H11NO4S
Mol. Mass.229.253
SMILESCc1ccc(cc1)S(=O)(=O)NCC(O)=O