Reaction Details
TargetCarbonic anhydrase 9
LigandBDBM50046165
Substrate/Competitorn/a
Meas. Tech.ChEMBL_1447569 (CHEMBL3373764)
IC50 94±n/a nM
Citation Rosatelli, ECarotti, ACeruso, MSupuran, CTGioiello, A Flow synthesis and biological activity of aryl sulfonamides as selective carbonic anhydrase IX and XII inhibitors. Bioorg Med Chem Lett24:3422-5 (2014) 
 
Carbonic anhydrase 9
Name:Carbonic anhydrase 9
Type:Enzyme
Mol. Mass.:49669.03
Organism:Homo sapiens (Human)
Description:Catalytic domain of human cloned isozyme was used in the assay
Residue:459
BDBM50046165
NameBDBM50046165
Synonyms:CHEMBL1621411
TypeSmall organic molecule
Emp. Form.C12H20N2O2S
Mol. Mass.256.364
SMILESCN(C)CCCNS(=O)(=O)c1ccc(C)cc1