Reaction Details
TargetCarbonic anhydrase 2
LigandBDBM50046171
Substrate/Competitorn/a
Meas. Tech.ChEMBL_1447567 (CHEMBL3373762)
IC50 7321±n/a nM
Citation Rosatelli, ECarotti, ACeruso, MSupuran, CTGioiello, A Flow synthesis and biological activity of aryl sulfonamides as selective carbonic anhydrase IX and XII inhibitors. Bioorg Med Chem Lett24:3422-5 (2014) 
 
Carbonic anhydrase 2
Name:Carbonic anhydrase 2
Type:Enzyme
Mol. Mass.:29250.71
Organism:Homo sapiens (Human)
Description:P00918
Residue:260
BDBM50046171
NameBDBM50046171
Synonyms:CHEMBL362436
TypeSmall organic molecule
Emp. Form.C12H10N2O4S
Mol. Mass.278.284
SMILES[O-][N+](=O)c1ccc(cc1)S(=O)(=O)Nc1ccccc1