Reaction Details
TargetCarbonic anhydrase 1
LigandBDBM50046169
Substrate/Competitorn/a
Meas. Tech.ChEMBL_1447565 (CHEMBL3373760)
IC50>50000±n/a nM
Citation Rosatelli, ECarotti, ACeruso, MSupuran, CTGioiello, A Flow synthesis and biological activity of aryl sulfonamides as selective carbonic anhydrase IX and XII inhibitors. Bioorg Med Chem Lett24:3422-5 (2014) 
 
Carbonic anhydrase 1
Name:Carbonic anhydrase 1
Type:Enzyme
Mol. Mass.:28873.37
Organism:Homo sapiens (Human)
Description:P00915
Residue:261
BDBM50046169
NameBDBM50046169
Synonyms:CHEMBL3310985
TypeSmall organic molecule
Emp. Form.C14H13NO3S
Mol. Mass.275.323
SMILESCC(=O)c1ccc(cc1)S(=O)(=O)Nc1ccccc1