Reaction Details
TargetPotassium voltage-gated channel subfamily H member 2
LigandBDBM50046411
Substrate/Competitorn/a
Meas. Tech.ChEMBL_1448459 (CHEMBL3378079)
IC50 20700±n/a nM
Citation Sviripa, VMZhang, WBalia, AGTsodikov, OVNickell, JRGizard, FYu, TLee, EYDwoskin, LPLiu, CWatt, DS 2',6'-Dihalostyrylanilines, pyridines, and pyrimidines for the inhibition of the catalytic subunit of methionine S-adenosyltransferase-2. J Med Chem57:6083-91 (2014) 
 
Potassium voltage-gated channel subfamily H member 2
Name:Potassium voltage-gated channel subfamily H member 2
Type:Multi-pass membrane protein
Mol. Mass.:126672.65
Organism:Homo sapiens (Human)
Description:Q12809
Residue:1159
BDBM50046411
NameBDBM50046411
Synonyms:CHEMBL3314424
TypeSmall organic molecule
Emp. Form.C15H14ClFN2
Mol. Mass.276.736
SMILESCN(C)c1ccc(\C=C\c2c(F)cccc2Cl)nc1