Reaction Details
TargetCoagulation factor X
LigandBDBM50046430
Substrate/Competitorn/a
Meas. Tech.ChEMBL_1449322 (CHEMBL3371468)
Ki 0.110000±n/a nM
Citation Orwat, MJQiao, JXHe, KRendina, ARLuettgen, JMRossi, KAXin, BKnabb, RMWexler, RRLam, PYPinto, DJ Orally bioavailable factor Xa inhibitors containing alpha-substituted gem-dimethyl P4 moieties. Bioorg Med Chem Lett24:3341-5 (2014) 
 
Coagulation factor X
Name:Coagulation factor X
Type:Enzyme
Mol. Mass.:54726.60
Organism:Homo sapiens (Human)
Description:n/a
Residue:488
BDBM50046430
NameBDBM50046430
Synonyms:CHEMBL3314442
TypeSmall organic molecule
Emp. Form.C26H32N4O4S
Mol. Mass.496.622
SMILESCOc1ccc(cc1)-n1nc(c2CCN(C(=O)c12)c1ccc(cc1)C(C)(C)CN(C)C)S(C)(=O)=O