Reaction Details
TargetCoagulation factor X
LigandBDBM50046441
Substrate/Competitorn/a
Meas. Tech.ChEMBL_1449322 (CHEMBL3371468)
Ki 0.060000±n/a nM
Citation Orwat, MJQiao, JXHe, KRendina, ARLuettgen, JMRossi, KAXin, BKnabb, RMWexler, RRLam, PYPinto, DJ Orally bioavailable factor Xa inhibitors containing alpha-substituted gem-dimethyl P4 moieties. Bioorg Med Chem Lett24:3341-5 (2014) 
 
Coagulation factor X
Name:Coagulation factor X
Type:Enzyme
Mol. Mass.:54726.60
Organism:Homo sapiens (Human)
Description:n/a
Residue:488
BDBM50046441
NameBDBM50046441
Synonyms:CHEMBL3314448
TypeSmall organic molecule
Emp. Form.C28H33N5O4
Mol. Mass.503.5927
SMILESCOc1ccc(cc1)-n1nc(C(N)=O)c2CCN(C(=O)c12)c1ccc(cc1)C(C)(C)CN1CCOCC1