Reaction Details
TargetUDP-N-acetylmuramoyl-L-alanyl-D-glutamate--2,6-diaminopimelate ligase
LigandBDBM50046822
Substrate/Competitorn/a
Meas. Tech.ChEMBL_1452800 (CHEMBL3365142)
IC50 330000±n/a nM
Citation Perdih, AHrast, MBarreteau, HGobec, SWolber, GSolmajer, T Benzene-1,3-dicarboxylic acid 2,5-dimethylpyrrole derivatives as multiple inhibitors of bacterial Mur ligases (MurC-MurF). Bioorg Med Chem22:4124-34 (2014) 
 
UDP-N-acetylmuramoyl-L-alanyl-D-glutamate--2,6-diaminopimelate ligase
Name:UDP-N-acetylmuramoyl-L-alanyl-D-glutamate--2,6-diaminopimelate ligase
Type:Protein
Mol. Mass.:53333.42
Organism:Escherichia coli UMNK88 (Enterobacteria)
Description:P22188
Residue:495
BDBM50046822
NameBDBM50046822
Synonyms:CHEMBL3310456
TypeSmall organic molecule
Emp. Form.C27H23N3O7
Mol. Mass.501.4874
SMILESCCc1ccc(cc1)N1C(=O)NC(=O)\C(=C\c2cc(C)n(c2C)-c2cc(cc(c2)C(O)=O)C(O)=O)C1=O