Reaction Details
TargetUDP-N-acetylmuramoyl-L-alanyl-D-glutamate--2,6-diaminopimelate ligase
LigandBDBM50046823
Substrate/Competitorn/a
Meas. Tech.ChEMBL_1452800 (CHEMBL3365142)
IC50 311000±n/a nM
Citation Perdih, AHrast, MBarreteau, HGobec, SWolber, GSolmajer, T Benzene-1,3-dicarboxylic acid 2,5-dimethylpyrrole derivatives as multiple inhibitors of bacterial Mur ligases (MurC-MurF). Bioorg Med Chem22:4124-34 (2014) 
 
UDP-N-acetylmuramoyl-L-alanyl-D-glutamate--2,6-diaminopimelate ligase
Name:UDP-N-acetylmuramoyl-L-alanyl-D-glutamate--2,6-diaminopimelate ligase
Type:Protein
Mol. Mass.:53333.42
Organism:Escherichia coli UMNK88 (Enterobacteria)
Description:P22188
Residue:495
BDBM50046823
NameBDBM50046823
Synonyms:CHEMBL3310457
TypeSmall organic molecule
Emp. Form.C25H18FN3O6S
Mol. Mass.507.49
SMILESCc1cc(\C=C2\C(=O)NC(=S)N(C2=O)c2ccccc2F)c(C)n1-c1cc(cc(c1)C(O)=O)C(O)=O