Reaction Details
TargetUDP-N-acetylmuramoyl-L-alanyl-D-glutamate--2,6-diaminopimelate ligase
LigandBDBM50046819
Substrate/Competitorn/a
Meas. Tech.ChEMBL_1452800 (CHEMBL3365142)
IC50 89000±n/a nM
Citation Perdih, AHrast, MBarreteau, HGobec, SWolber, GSolmajer, T Benzene-1,3-dicarboxylic acid 2,5-dimethylpyrrole derivatives as multiple inhibitors of bacterial Mur ligases (MurC-MurF). Bioorg Med Chem22:4124-34 (2014) 
 
UDP-N-acetylmuramoyl-L-alanyl-D-glutamate--2,6-diaminopimelate ligase
Name:UDP-N-acetylmuramoyl-L-alanyl-D-glutamate--2,6-diaminopimelate ligase
Type:Protein
Mol. Mass.:53333.42
Organism:Escherichia coli UMNK88 (Enterobacteria)
Description:P22188
Residue:495
BDBM50046819
NameBDBM50046819
Synonyms:CHEMBL3310465
TypeSmall organic molecule
Emp. Form.C24H18BrN3O5S
Mol. Mass.540.386
SMILESCc1cc(\C=C2\S\C(NC2=O)=N\c2ccc(Br)cc2)c(C)n1-c1cc(cc(c1)C(O)=O)C(O)=O