Reaction Details
TargetAmine oxidase [flavin-containing] A
LigandBDBM50087800
Substrate/Competitorn/a
Meas. Tech.ChEMBL_1453698 (CHEMBL3364100)
IC50 22±n/a nM
Citation Tzvetkov, NTHinz, SKüppers, PGastreich, MMüller, CE Indazole- and indole-5-carboxamides: selective and reversible monoamine oxidase B inhibitors with subnanomolar potency. J Med Chem57:6679-703 (2014) 
 
Amine oxidase [flavin-containing] A
Name:Amine oxidase [flavin-containing] A
Type:Enzyme
Mol. Mass.:59515.21
Organism:Rattus norvegicus (rat)
Description:n/a
Residue:526
BDBM50087800
NameBDBM50087800
Synonyms:(5-Benzyloxy-1H-indol-2-ylmethyl)-prop-2-ynyl-amine | CHEMBL45069
TypeSmall organic molecule
Emp. Form.C19H18N2O
Mol. Mass.290.359
SMILESC#CCNCc1cc2cc(OCc3ccccc3)ccc2[nH]1