Reaction Details
TargetDNA gyrase subunit B
LigandBDBM50047346
Substrate/Competitorn/a
Meas. Tech.ChEMBL_1454592 (CHEMBL3366704)
IC50<9.8±n/a nM
Citation Basarab, GSHill, PJGarner, CEHull, KGreen, OSherer, BADangel, PBManchester, JIBist, SHauck, SZhou, FUria-Nickelsen, MIllingworth, RAlm, RRooney, MEakin, AE Optimization of pyrrolamide topoisomerase II inhibitors toward identification of an antibacterial clinical candidate (AZD5099). J Med Chem57:6060-82 (2014) 
 
DNA gyrase subunit B
Name:DNA gyrase subunit B
Type:Enzyme Subunit
Mol. Mass.:72530.91
Organism:Staphylococcus aureus
Description:n/a
Residue:644
BDBM50047346
NameBDBM50047346
Synonyms:CHEMBL3314589
TypeSmall organic molecule
Emp. Form.C21H21Cl2N5O4S
Mol. Mass.510.394
SMILESCO[C@H]1CN(CC[C@H]1NC(=O)c1[nH]c(C)c(Cl)c1Cl)c1nc(c(s1)C(O)=O)-c1ccccn1