Reaction Details
TargetATP-binding cassette sub-family C member 2
LigandBDBM50047200
Substrate/Competitorn/a
Meas. Tech.ChEMBL_1455461 (CHEMBL3363893)
EC50>200000±n/a nM
Citation Basarab, GSHill, PJGarner, CEHull, KGreen, OSherer, BADangel, PBManchester, JIBist, SHauck, SZhou, FUria-Nickelsen, MIllingworth, RAlm, RRooney, MEakin, AE Optimization of pyrrolamide topoisomerase II inhibitors toward identification of an antibacterial clinical candidate (AZD5099). J Med Chem57:6060-82 (2014) 
 
ATP-binding cassette sub-family C member 2
Name:ATP-binding cassette sub-family C member 2
Type:Protein
Mol. Mass.:174229.45
Organism:Homo sapiens (Human)
Description:Q92887
Residue:1545
BDBM50047200
NameBDBM50047200
Synonyms:CHEMBL3314564
TypeSmall organic molecule
Emp. Form.C20H25Cl2N5O6S
Mol. Mass.534.413
SMILESCOCCNC(=O)c1nc(sc1C(O)=O)N1CC[C@@H](NC(=O)c2[nH]c(C)c(Cl)c2Cl)[C@H](C1)OC