Reaction Details
TargetCalcitonin gene-related peptide type 1 receptor
LigandBDBM50184069
Substrate/Competitorn/a
Meas. Tech.ChEMBL_1457286 (CHEMBL3370551)
Ki 3.4±n/a nM
Citation Bell, IM Calcitonin gene-related peptide receptor antagonists: new therapeutic agents for migraine. J Med Chem57:7838-58 (2014) 
 
Calcitonin gene-related peptide type 1 receptor
Name:Calcitonin gene-related peptide type 1 receptor
Type:PROTEIN
Mol. Mass.:53330.91
Organism:Rattus norvegicus
Description:ChEMBL_1457286
Residue:464
BDBM50184069
NameBDBM50184069
Synonyms:CHEMBL207197 N-{(1S)-5-amino-1-[(4-pyridin-4-ylpiperazin-1-yl)carbonyl]pentyl}-3,5-dibromo-Nalpha-{[4-(2-oxo-1,4-dihydroquinazolin-3(2H)-yl)piperidin-1-yl]carbonyl}-D-tyrosinamide | OLCEGEPANT
TypeSmall organic molecule
Emp. Form.C38H47Br2N9O5
Mol. Mass.869.645
SMILESNCCCC[C@H](NC(=O)[C@@H](Cc1cc(Br)c(O)c(Br)c1)NC(=O)N1CCC(CC1)N1Cc2ccccc2NC1=O)C(=O)N1CCN(CC1)c1ccncc1