Reaction Details
TargetHistone deacetylase
LigandBDBM50047418
Substrate/Competitorn/a
Meas. Tech.ChEMBL_1450204 (CHEMBL3375767)
IC50 3.4±n/a nM
Citation McCoull, WBarton, PBrown, AJBowker, SSCameron, JClarke, DSDavies, RDDossetter, AGErtan, AFenwick, MGreen, CHolmes, JLMartin, NMasters, DMoore, JENewcombe, NJNewton, CPointon, HRobb, GRSheldon, CStokes, SMorgan, D Identification, optimization, and pharmacology of acylurea GHS-R1a inverse agonists. J Med Chem57:6128-40 (2014) 
 
Histone deacetylase
Name:Histone deacetylase
Type:PROTEIN
Mol. Mass.:34754.92
Organism:Rattus norvegicus
Description:ChEMBL_104809
Residue:328
BDBM50047418
NameBDBM50047418
Synonyms:CHEMBL3319223
TypeSmall organic molecule
Emp. Form.C27H33ClN6O5S2
Mol. Mass.621.171
SMILESCN1CCN(CCCS(=O)(=O)c2ccc3nc(NC(=O)NC(=O)c4cc(ccc4Cl)N4CCOCC4)sc3c2)CC1