Reaction Details
TargetGrowth hormone secretagogue receptor type 1
LigandBDBM50047655
Substrate/Competitorn/a
Meas. Tech.ChEMBL_1449409 (CHEMBL3373238)
IC50 8.6±n/a nM
Citation McCoull, WBarton, PBrown, AJBowker, SSCameron, JClarke, DSDavies, RDDossetter, AGErtan, AFenwick, MGreen, CHolmes, JLMartin, NMasters, DMoore, JENewcombe, NJNewton, CPointon, HRobb, GRSheldon, CStokes, SMorgan, D Identification, optimization, and pharmacology of acylurea GHS-R1a inverse agonists. J Med Chem57:6128-40 (2014) 
 
Growth hormone secretagogue receptor type 1
Name:Growth hormone secretagogue receptor type 1
Type:Receptor
Mol. Mass.:41334.57
Organism:Homo sapiens (Human)
Description:Receptor binding studies use plasma membranes from LLC PK-1 cells transiently transfected with hGHSR1a.
Residue:366
BDBM50047655
NameBDBM50047655
Synonyms:CHEMBL3319214
TypeSmall organic molecule
Emp. Form.C21H23ClN4O5S2
Mol. Mass.511.014
SMILESCOCCNCCCS(=O)(=O)c1ccc2nc(NC(=O)NC(=O)c3ccccc3Cl)sc2c1