Reaction Details
TargetHistone deacetylase 6
LigandBDBM50047963
Substrate/Competitorn/a
Meas. Tech.ChEMBL_1452868 (CHEMBL3365885)
Temperature298.15±n/a K
IC50 16100±n/a nM
Commentsextracted
Citation Valente, STrisciuoglio, DDe Luca, TNebbioso, ALabella, DLenoci, ABigogno, CDondio, GMiceli, MBrosch, GDel Bufalo, DAltucci, LMai, A 1,3,4-Oxadiazole-containing histone deacetylase inhibitors: anticancer activities in cancer cells. J Med Chem57:6259-65 (2014) 
 
Histone deacetylase 6
Name:Histone deacetylase 6
Type:Chromatin regulator; hydrolase; repressor
Mol. Mass.:131381.51
Organism:Homo sapiens (Human)
Description:Q9UBN7
Residue:1215
BDBM50047963
NameBDBM50047963
Synonyms:CHEMBL3314868
TypeSmall organic molecule
Emp. Form.C26H20N4O2
Mol. Mass.420.4626
SMILESNc1ccccc1NC(=O)c1ccc(cc1)-c1nnc(Cc2cccc3ccccc23)o1