Reaction Details
TargetHistone deacetylase 6
LigandBDBM50047967
Substrate/Competitorn/a
Meas. Tech.ChEMBL_1452868 (CHEMBL3365885)
Temperature298.15±n/a K
IC50 30±n/a nM
Commentsextracted
Citation Valente, STrisciuoglio, DDe Luca, TNebbioso, ALabella, DLenoci, ABigogno, CDondio, GMiceli, MBrosch, GDel Bufalo, DAltucci, LMai, A 1,3,4-Oxadiazole-containing histone deacetylase inhibitors: anticancer activities in cancer cells. J Med Chem57:6259-65 (2014) 
 
Histone deacetylase 6
Name:Histone deacetylase 6
Type:Chromatin regulator; hydrolase; repressor
Mol. Mass.:131381.51
Organism:Homo sapiens (Human)
Description:Q9UBN7
Residue:1215
BDBM50047967
NameBDBM50047967
Synonyms:CHEMBL3314861
TypeSmall organic molecule
Emp. Form.C23H19N3O3
Mol. Mass.385.4153
SMILESONC(=O)\C=C\c1ccc(Cc2nnc(Cc3cccc4ccccc34)o2)cc1