Reaction Details
TargetCannabinoid receptor 1
LigandBDBM50438783
Substrate/Competitorn/a
Meas. Tech.ChEMBL_1453720 (CHEMBL3364122)
Ki 480±n/a nM
Citation Hajdu, ZNicolussi, SRau, MLorántfy, LForgo, PHohmann, JCsupor, DGertsch, J Identification of endocannabinoid system-modulating N-alkylamides from Heliopsis helianthoides var. scabra and Lepidium meyenii. J Nat Prod77:1663-9 (2014) 
 
Cannabinoid receptor 1
Name:Cannabinoid receptor 1
Type:G Protein-Coupled Receptor (GPCR)
Mol. Mass.:52868.96
Organism:Homo sapiens (Human)
Description:P21554
Residue:472
BDBM50438783
NameBDBM50438783
Synonyms:CHEMBL2415106
TypeSmall organic molecule
Emp. Form.C25H39NO
Mol. Mass.369.5833
SMILESCCCCC\C=C/C\C=C/CCCCCCCC(=O)NCc1ccccc1