Reaction Details
TargetCannabinoid receptor 1
LigandBDBM50048063
Substrate/Competitorn/a
Meas. Tech.ChEMBL_1453720 (CHEMBL3364122)
Ki 310±n/a nM
Citation Hajdu, ZNicolussi, SRau, MLorántfy, LForgo, PHohmann, JCsupor, DGertsch, J Identification of endocannabinoid system-modulating N-alkylamides from Heliopsis helianthoides var. scabra and Lepidium meyenii. J Nat Prod77:1663-9 (2014) 
 
Cannabinoid receptor 1
Name:Cannabinoid receptor 1
Type:G Protein-Coupled Receptor (GPCR)
Mol. Mass.:52868.96
Organism:Homo sapiens (Human)
Description:P21554
Residue:472
BDBM50048063
NameBDBM50048063
Synonyms:CHEMBL3314943
TypeSmall organic molecule
Emp. Form.C21H35NO
Mol. Mass.317.5087
SMILESCCC\C=C\C\C=C\CCC\C=C\C=C\C(=O)NCC(C)CC